Target
Phospholipase C
Ligand
BDBM50332099
Substrate
Meas. Tech.
ChEMBL_687786 (CHEMBL1291232)
IC50
23000±n/a nM
Citation
 González-Bulnes, PGonzález-Roura, ACanals, DDelgado, ACasas, JLlebaria, A 2-aminohydroxamic acid derivatives as inhibitors of Bacillus cereus phosphatidylcholine preferred phospholipase C PC-PLC(Bc). Bioorg Med Chem 18:8549-55 (2010)  
Target
Name:
Phospholipase C
Synonyms:
Cereolysin A Phosphatidylcholine cholinephosphohydrolase | plc
Type:
PROTEIN
Mol. Mass.:
32387.39
Organism:
Bacillus cereus
Description:
ChEMBL_687786
Residue:
283
  
Inhibitor
Name:
BDBM50332099
Synonyms:
2-(N-(benzyloxy)-2-(tert-butyloxycarbonylamino)icosanamido-N,N,N-trimethylethan-1-aminium iodide | CHEMBL1288994
Type:
Small organic molecule
Emp. Form.:
C37H68N3O4
Mol. Mass.:
618.953
SMILES:
CCCCCCCCCCCCCCCCCCC(NC(=O)OC(C)(C)C)C(=O)N(CC[N+](C)(C)C)OCc1ccccc1
: