Target
Serine/threonine-protein kinase Chk1
Ligand
BDBM50332130
Substrate
Meas. Tech.
ChEMBL_687950 (CHEMBL1291622)
IC50
4±n/a nM
Citation
 Zhao, LZhang, YDai, CGuzi, TWiswell, DSeghezzi, WParry, DFischmann, TSiddiqui, MA Design, synthesis and SAR of thienopyridines as potent CHK1 inhibitors. Bioorg Med Chem Lett 20:7216-21 (2010)  
Target
Name:
Serine/threonine-protein kinase Chk1
Synonyms:
CHEK1 CHK1 checkpoint homolog Checkpoint kinase-1 (CHK1)
Type:
Enzyme Catalytic Domain
Mol. Mass.:
54443.02
Organism:
Homo sapiens (Human)
Description:
gi_166295192
Residue:
476
  
Inhibitor
Name:
BDBM50332130
Synonyms:
(S)-2-(3-chlorophenyl)-4-(piperidin-3-ylamino)thieno[3,2-c]pyridine-7-carboxamide | CHEMBL1288303
Type:
Small organic molecule
Emp. Form.:
C19H19ClN4OS
Mol. Mass.:
386.898
SMILES:
NC(=O)c1cnc(N[C@H]2CCCNC2)c2cc(sc12)-c1cccc(Cl)c1
: