Target
Serine/threonine-protein kinase Chk1
Ligand
BDBM50332175
Substrate
Meas. Tech.
ChEMBL_687950 (CHEMBL1291622)
IC50
707±n/a nM
Citation
 Zhao, LZhang, YDai, CGuzi, TWiswell, DSeghezzi, WParry, DFischmann, TSiddiqui, MA Design, synthesis and SAR of thienopyridines as potent CHK1 inhibitors. Bioorg Med Chem Lett 20:7216-21 (2010)  
Target
Name:
Serine/threonine-protein kinase Chk1
Synonyms:
CHEK1 CHK1 checkpoint homolog Checkpoint kinase-1 (CHK1)
Type:
Enzyme Catalytic Domain
Mol. Mass.:
54443.02
Organism:
Homo sapiens (Human)
Description:
gi_166295192
Residue:
476
  
Inhibitor
Name:
BDBM50332175
Synonyms:
4-(azetidin-3-ylamino)-2-(4-chlorophenyl)thieno[3,2-c]pyridine-7-carboxamide | CHEMBL1288131
Type:
Small organic molecule
Emp. Form.:
C17H15ClN4OS
Mol. Mass.:
358.845
SMILES:
NC(=O)c1cnc(NC2CNC2)c2cc(sc12)-c1ccc(Cl)cc1
: