Target
Glutamate carboxypeptidase 2
Ligand
BDBM50332220
Substrate
Meas. Tech.
ChEMBL_687982 (CHEMBL1291654)
IC50
54±n/a nM
Citation
 Grella, BAdams, JBerry, JFDelahanty, GFerraris, DVMajer, PNi, CShukla, KShuler, SASlusher, BSStathis, MTsukamoto, T The discovery and structure-activity relationships of indole-based inhibitors of glutamate carboxypeptidase II. Bioorg Med Chem Lett 20:7222-5 (2010)  
Target
Name:
Glutamate carboxypeptidase 2
Synonyms:
FGCP FOLH1 Folate hydrolase 1 Glutamate carboxypeptidase 2 Membrane glutamate carboxypeptidase NAALAD1 PSM Prostate-specific membrane antigen mGCP
Type:
PROTEIN
Mol. Mass.:
84333.66
Organism:
Homo sapiens (Human)
Description:
ChEMBL_1497035
Residue:
750
  
Inhibitor
Name:
BDBM50332220
Synonyms:
1-[(2-bromo-5-carboxyphenyl)methyl]-3-(2-mercaptoethyl)-1H-indole-2-carboxylic acid | CHEMBL1288259
Type:
Small organic molecule
Emp. Form.:
C19H16BrNO4S
Mol. Mass.:
434.304
SMILES:
OC(=O)c1c(CCS)c2ccccc2n1Cc1cc(ccc1Br)C(O)=O
: