Target
Glutamate carboxypeptidase 2
Ligand
BDBM50332224
Substrate
Meas. Tech.
ChEMBL_687982 (CHEMBL1291654)
IC50
24000±n/a nM
Citation
 Grella, BAdams, JBerry, JFDelahanty, GFerraris, DVMajer, PNi, CShukla, KShuler, SASlusher, BSStathis, MTsukamoto, T The discovery and structure-activity relationships of indole-based inhibitors of glutamate carboxypeptidase II. Bioorg Med Chem Lett 20:7222-5 (2010)  
Target
Name:
Glutamate carboxypeptidase 2
Synonyms:
FGCP FOLH1 Folate hydrolase 1 Glutamate carboxypeptidase 2 Membrane glutamate carboxypeptidase NAALAD1 PSM Prostate-specific membrane antigen mGCP
Type:
PROTEIN
Mol. Mass.:
84333.66
Organism:
Homo sapiens (Human)
Description:
ChEMBL_1497035
Residue:
750
  
Inhibitor
Name:
BDBM50332224
Synonyms:
1-(3-carboxybenzyl)-3-(2-hydroxyethyl)-1H-indole-2-carboxylic acid | CHEMBL1287843
Type:
Small organic molecule
Emp. Form.:
C19H17NO5
Mol. Mass.:
339.342
SMILES:
OCCc1c(C(O)=O)n(Cc2cccc(c2)C(O)=O)c2ccccc12
: