Target
Glutamate carboxypeptidase 2
Ligand
BDBM50246899
Substrate
Meas. Tech.
ChEMBL_687982 (CHEMBL1291654)
Ki
0.01±n/a nM
Citation
 Grella, BAdams, JBerry, JFDelahanty, GFerraris, DVMajer, PNi, CShukla, KShuler, SASlusher, BSStathis, MTsukamoto, T The discovery and structure-activity relationships of indole-based inhibitors of glutamate carboxypeptidase II. Bioorg Med Chem Lett 20:7222-5 (2010)  
Target
Name:
Glutamate carboxypeptidase 2
Synonyms:
FGCP FOLH1 Folate hydrolase 1 Glutamate carboxypeptidase 2 Membrane glutamate carboxypeptidase NAALAD1 PSM Prostate-specific membrane antigen mGCP
Type:
PROTEIN
Mol. Mass.:
84333.66
Organism:
Homo sapiens (Human)
Description:
ChEMBL_1497035
Residue:
750
  
Inhibitor
Name:
BDBM50246899
Synonyms:
(S)-2-(3-((S)-1-carboxy-5-(4-iodobenzamido)pentyl)ureido)pentanedioic acid N-{[(1S)-1-carboxy-5-{[(4-iodophenyl)carbonyl]amino}pentyl]carbamoyl}-L-glutamic acid
Type:
Small organic molecule
Emp. Form.:
C19H24IN3O8
Mol. Mass.:
549.3136
SMILES:
OC(=O)CC[C@H](NC(=O)N[C@@H](CCCCNC(=O)c1ccc(I)cc1)C(O)=O)C(O)=O
: