Target
Cannabinoid receptor 2
Ligand
BDBM50332246
Substrate
Meas. Tech.
ChEMBL_685961 (CHEMBL1292717)
Ki
>10000±n/a nM
Citation
 Osman, NAMahmoud, AHAllarà, MNiess, RAbouzid, KADi Marzo, VAbadi, AH Synthesis, binding studies and molecular modeling of novel cannabinoid receptor ligands. Bioorg Med Chem 18:8463-77 (2010)  
Target
Name:
Cannabinoid receptor 2
Synonyms:
CANNABINOID CB2 CB2 CB2B CNR2_HUMAN Cannabinoid CB2 receptor Cannabinoid receptor 2 (CB2R) | hCB2
Type:
G Protein-Coupled Receptor (GPCR)
Mol. Mass.:
39690.94
Organism:
Homo sapiens (Human)
Description:
P34972
Residue:
360
  
Inhibitor
Name:
BDBM50332246
Synonyms:
(E)-N-(4-Hydroxyphenyl)-6-(4-methoxyphenyl)-4-oxohex-5-enamide | CHEMBL1288118
Type:
Small organic molecule
Emp. Form.:
C19H19NO4
Mol. Mass.:
325.3585
SMILES:
COc1ccc(C=CC(=O)CCC(=O)Nc2ccc(O)cc2)cc1
: