Target
Sodium- and chloride-dependent glycine transporter 1
Ligand
BDBM50332361
Substrate
Meas. Tech.
ChEMBL_694812 (CHEMBL1639759)
EC50
14±n/a nM
Citation
 Pinard, EAlberati, DBender, MBorroni, EBrom, VBurner, SFischer, HHainzl, DHalm, RHauser, NJolidon, SLengyel, JMarty, HPMeyer, TMoreau, JLMory, RNarquizian, RNorcross, RDSchmid, PWermuth, RZimmerli, D Discovery of benzoylisoindolines as a novel class of potent, selective and orally active GlyT1 inhibitors. Bioorg Med Chem Lett 20:6960-5 (2010)  
Target
Name:
Sodium- and chloride-dependent glycine transporter 1
Synonyms:
GlyT-1 Glycine Transporters (GlyT1c) SC6A9_HUMAN Sodium- and chloride-dependent glycine transporter 1 Sodium- and chloride-dependent glycine transporter 1 (GlyT1c) Solute carrier family 6 member 9
Type:
Enzyme
Mol. Mass.:
78270.54
Organism:
Homo sapiens (Human)
Description:
P48067
Residue:
706
  
Inhibitor
Name:
BDBM50332361
Synonyms:
(S)-(5-(methylsulfonyl)-2-(1,1,1-trifluoropropan-2-yloxy)phenyl)(5-(tetrahydro-2H-pyran-4-yl)isoindolin-2-yl)methanone | CHEMBL1631023
Type:
Small organic molecule
Emp. Form.:
C24H26F3NO5S
Mol. Mass.:
497.527
SMILES:
C[C@H](Oc1ccc(cc1C(=O)N1Cc2ccc(cc2C1)C1CCOCC1)S(C)(=O)=O)C(F)(F)F
: