Target
Sodium- and chloride-dependent glycine transporter 1
Ligand
BDBM50332366
Substrate
Meas. Tech.
ChEMBL_694812 (CHEMBL1639759)
EC50
132±n/a nM
Citation
 Pinard, EAlberati, DBender, MBorroni, EBrom, VBurner, SFischer, HHainzl, DHalm, RHauser, NJolidon, SLengyel, JMarty, HPMeyer, TMoreau, JLMory, RNarquizian, RNorcross, RDSchmid, PWermuth, RZimmerli, D Discovery of benzoylisoindolines as a novel class of potent, selective and orally active GlyT1 inhibitors. Bioorg Med Chem Lett 20:6960-5 (2010)  
Target
Name:
Sodium- and chloride-dependent glycine transporter 1
Synonyms:
GlyT-1 Glycine Transporters (GlyT1c) SC6A9_HUMAN Sodium- and chloride-dependent glycine transporter 1 Sodium- and chloride-dependent glycine transporter 1 (GlyT1c) Solute carrier family 6 member 9
Type:
Enzyme
Mol. Mass.:
78270.54
Organism:
Homo sapiens (Human)
Description:
P48067
Residue:
706
  
Inhibitor
Name:
BDBM50332366
Synonyms:
(S)-(5-(methylsulfonyl)-2-(1,1,1-trifluoropropan-2-yloxy)phenyl)(6-(trifluoromethyl)-1H-pyrrolo[3,4-c]pyridin-2(3H)-yl)methanone | CHEMBL1631018
Type:
Small organic molecule
Emp. Form.:
C19H16F6N2O4S
Mol. Mass.:
482.397
SMILES:
C[C@H](Oc1ccc(cc1C(=O)N1Cc2cnc(cc2C1)C(F)(F)F)S(C)(=O)=O)C(F)(F)F
: