Target
GABA-A receptor; alpha-2/beta-3/gamma-2
Ligand
BDBM50332376
Substrate
Meas. Tech.
ChEMBL_696702 (CHEMBL1638614)
EC50
104±n/a nM
Citation
 Liu, XFChang, HFSchmiesing, RJWesolowski, SSKnappenberger, KSArriza, JLChapdelaine, MJ Developing dual functional allosteric modulators of GABA(A) receptors. Bioorg Med Chem 18:8374-82 (2010)  
Target
Name:
GABA-A receptor; alpha-2/beta-3/gamma-2
Synonyms:
GABA receptor alpha-2/beta-3/gamma-2 subunit | Gamma-aminobutyric acid receptor subunit alpha-2/beta-3/gamma-2
Type:
Mol. Mass.:
Description:
ASSAY_ID of ChEMBL is 2148174
Components:
This complex has 3 components.
Component 1
Name:
Gamma-aminobutyric acid receptor subunit gamma-2
Synonyms:
GABA(A) receptor subunit gamma-2 GBRG2_HUMAN
Type:
PROTEIN
Mol. Mass.:
54172.74
Organism:
Homo sapiens (Human)
Description:
EBI_217
Residue:
467
  
Component 2
Name:
Gamma-aminobutyric acid receptor subunit beta-3
Synonyms:
GABA A receptor alpha-4/beta-3/gamma-2 GABA-A receptor GBRB3_HUMAN | agonist GABA site
Type:
PROTEIN
Mol. Mass.:
54130.51
Organism:
Homo sapiens (Human)
Description:
ChEMBL_448071
Residue:
473
  
Component 3
Name:
Gamma-aminobutyric acid receptor subunit alpha-2
Synonyms:
GABA receptor alpha-2 subunit GBRA2_HUMAN | Gamma-aminobutyric acid receptor subunit alpha-2 (GABRA2)
Type:
Protein
Mol. Mass.:
51338.78
Organism:
Homo sapiens (Human)
Description:
P47869
Residue:
451
  
Inhibitor
Name:
BDBM50332376
Synonyms:
4-Amino-N-propyl-8-(pyrimidin-2-yl)cinnoline-3-carboxamide | CHEMBL1631468
Type:
Small organic molecule
Emp. Form.:
C16H16N6O
Mol. Mass.:
308.3378
SMILES:
CCCNC(=O)c1nnc2c(cccc2c1N)-c1ncccn1
: