Target
GABA-A receptor; alpha-5/beta-3/gamma-2
Ligand
BDBM50332374
Substrate
Meas. Tech.
ChEMBL_696705 (CHEMBL1638617)
Ki
14±n/a nM
Citation
 Liu, XFChang, HFSchmiesing, RJWesolowski, SSKnappenberger, KSArriza, JLChapdelaine, MJ Developing dual functional allosteric modulators of GABA(A) receptors. Bioorg Med Chem 18:8374-82 (2010)  
Target
Name:
GABA-A receptor; alpha-5/beta-3/gamma-2
Synonyms:
GABA receptor alpha-5/beta-3/gamma-2 subunit | Gamma-aminobutyric acid receptor subunit alpha-5/beta-3/gamma-2
Type:
Mol. Mass.:
Description:
ASSAY_ID of ChEMBL is 2148177
Components:
This complex has 3 components.
Component 1
Name:
Gamma-aminobutyric acid receptor subunit gamma-2
Synonyms:
GABA(A) receptor subunit gamma-2 GBRG2_HUMAN
Type:
PROTEIN
Mol. Mass.:
54172.74
Organism:
Homo sapiens (Human)
Description:
EBI_217
Residue:
467
  
Component 2
Name:
Gamma-aminobutyric acid receptor subunit beta-3
Synonyms:
GABA A receptor alpha-4/beta-3/gamma-2 GABA-A receptor GBRB3_HUMAN | agonist GABA site
Type:
PROTEIN
Mol. Mass.:
54130.51
Organism:
Homo sapiens (Human)
Description:
ChEMBL_448071
Residue:
473
  
Component 3
Name:
Gamma-aminobutyric acid receptor subunit alpha-5
Synonyms:
GABA receptor alpha-5 subunit GABRA5 Gamma-aminobutyric acid receptor subunit alpha-5 (GABA(A)) | Gamma-aminobutyric acid receptor subunit alpha-5 (GABAA)
Type:
Enzyme
Mol. Mass.:
52160.59
Organism:
Homo sapiens (Human)
Description:
P31644
Residue:
462
  
Inhibitor
Name:
BDBM50332374
Synonyms:
9-Amino-2-cyclobutyl-5-(pyrimidin-2-yl)-2,3-dihydro-1H-pyrrolo[3,4-b]quinolin-1-one | CHEMBL1631466
Type:
Small organic molecule
Emp. Form.:
C19H17N5O
Mol. Mass.:
331.3712
SMILES:
Nc1c2c(cn(C3CCC3)c2=O)[nH]c2c(cccc12)-c1ncccn1
: