Target
Peroxisome proliferator-activated receptor delta
Ligand
BDBM50332466
Substrate
Meas. Tech.
ChEMBL_696426 (CHEMBL1640279)
EC50
1±n/a nM
Citation
 Chin, JHong, JYLee, JHwang, HKo, HChoi, HHahn, DKo, JNam, SJTak, JHam, JKang, H Selective peroxisome proliferator-activated receptord isosteric selenium agonists as potent anti-atherogenic agents in vivo. Bioorg Med Chem Lett 20:7239-42 (2010)  
Target
Name:
Peroxisome proliferator-activated receptor delta
Synonyms:
NR1C2 NUCI Nuclear receptor subfamily 1 group C member 2 PPAR-beta PPARD Peroxisome proliferator-activated receptor Peroxisome proliferator-activated receptor delta
Type:
Enzyme
Mol. Mass.:
49910.45
Organism:
Homo sapiens (Human)
Description:
Q03181
Residue:
441
  
Inhibitor
Name:
BDBM50332466
Synonyms:
2-(4-((2-(3-fluoro-4-(trifluoromethyl)phenyl)-4-methylthiazol-5-yl)methylselanyl)-2-methylphenoxy)acetic acid | CHEMBL1630383
Type:
Small organic molecule
Emp. Form.:
C21H17F4NO3SSe
Mol. Mass.:
518.38
SMILES:
Cc1nc(sc1C[Se]c1ccc(OCC(O)=O)c(C)c1)-c1ccc(c(F)c1)C(F)(F)F
: