Target
Aldehyde oxidase
Ligand
BDBM50017716
Substrate
Meas. Tech.
ChEMBL_696364 (CHEMBL1640077)
IC50
>200000±n/a nM
Citation
 Pryde, DCDalvie, DHu, QJones, PObach, RSTran, TD Aldehyde oxidase: an enzyme of emerging importance in drug discovery. J Med Chem 53:8441-60 (2010)  
Target
Name:
Aldehyde oxidase
Synonyms:
AO AOXA_HUMAN | Aldehyde oxidase
Type:
PROTEIN
Mol. Mass.:
147930.97
Organism:
Homo sapiens (Human)
Description:
ChEMBL_1481150
Residue:
1338
  
Inhibitor
Name:
BDBM50017716
Synonyms:
2,2-Diphenyl-pentanoic acid 2-diethylamino-ethyl ester 2-Benzhydryl-pentanoic acid 2-diethylamino-ethyl ester PROADIFEN HYDROCHLORIDE
Type:
Small organic molecule
Emp. Form.:
C23H31NO2
Mol. Mass.:
353.4977
SMILES:
CCCC(C(=O)OCCN(CC)CC)(c1ccccc1)c1ccccc1
: