Target
Neuronal acetylcholine receptor subunit alpha-4/beta-2
Ligand
BDBM82070
Substrate
Meas. Tech.
ChEMBL_696892 (CHEMBL1639408)
Ki
2±n/a nM
Citation
 Dallanoce, CMagrone, PMatera, CLo Presti, LDe Amici, MRiganti, LClementi, FGotti, CDe Micheli, C Synthesis of novel chiral¿2-isoxazoline derivatives related to ABT-418 and estimation of their affinity at neuronal nicotinic acetylcholine receptor subtypes. Eur J Med Chem 45:5594-601 (2010)  
Target
Name:
Neuronal acetylcholine receptor subunit alpha-4/beta-2
Synonyms:
Neuronal acetylcholine receptor alpha4/beta2 Neuronal acetylcholine receptor; alpha4/beta2
Type:
Mol. Mass.:
Description:
Components:
This complex has 0 components.
Component 1
Name:
Neuronal acetylcholine receptor subunit alpha-4
Synonyms:
ACHA4_RAT Cholinergic, Nicotinic Alpha4Beta2 Chrna4 Neuronal acetylcholine receptor (alpha4beta2 nAChR) Neuronal acetylcholine receptor subunit alpha 4 beta 2 | Neuronal acetylcholine receptor subunit alpha-4
Type:
Enzyme
Mol. Mass.:
70196.44
Organism:
Rattus norvegicus (Rat)
Description:
P09483
Residue:
630
  
Component 2
Name:
Neuronal acetylcholine receptor subunit beta-2
Synonyms:
ACHB2_RAT Chrnb2 Neuronal acetylcholine receptor non-alpha-1 chain
Type:
Enzyme
Mol. Mass.:
56910.32
Organism:
Rattus norvegicus (Rat)
Description:
P12390
Residue:
500
  
Inhibitor
Name:
BDBM82070
Synonyms:
CAS_29790-52-1 Nicotine-D salicylate US9303017, Nicotine
Type:
Emp. Form.:
C10H14N2
Mol. Mass.:
162.2316
SMILES:
CN1CCC[C@H]1c1cccnc1
: