Target
Matrilysin
Ligand
BDBM50332950
Substrate
Meas. Tech.
ChEMBL_694545 (CHEMBL1635954)
Ki
984±n/a nM
Citation
 Attolino, ECalderone, VDragoni, EFragai, MRichichi, BLuchinat, CNativi, C Structure-based approach to nanomolar, water soluble matrix metalloproteinases inhibitors (MMPIs). Eur J Med Chem 45:5919-25 (2010)  
Target
Name:
Matrilysin
Synonyms:
MMP7 MPSL1 Matrix metalloproteinase-7 (MMP-7) PUMP1
Type:
Enzyme
Mol. Mass.:
29681.54
Organism:
Homo sapiens (Human)
Description:
P09237
Residue:
267
  
Inhibitor
Name:
BDBM50332950
Synonyms:
(2R,3R)-N,3-dihydroxy-2-(4-methoxyphenylsulfonamido)butanamide | CHEMBL1632640
Type:
Small organic molecule
Emp. Form.:
C11H16N2O6S
Mol. Mass.:
304.32
SMILES:
COc1ccc(cc1)S(=O)(=O)N[C@H]([C@@H](C)O)C(=O)NO
: