Target
Neutrophil collagenase
Ligand
BDBM50332949
Substrate
Meas. Tech.
ChEMBL_694546 (CHEMBL1635955)
Ki
9±n/a nM
Citation
 Attolino, ECalderone, VDragoni, EFragai, MRichichi, BLuchinat, CNativi, C Structure-based approach to nanomolar, water soluble matrix metalloproteinases inhibitors (MMPIs). Eur J Med Chem 45:5919-25 (2010)  
Target
Name:
Neutrophil collagenase
Synonyms:
CLG1 MMP8 Matrix metalloproteinase-8 PMNL collagenase | PMNL-CL
Type:
Enzyme
Mol. Mass.:
53413.48
Organism:
Homo sapiens (Human)
Description:
P22894
Residue:
467
  
Inhibitor
Name:
BDBM50332949
Synonyms:
(R)-N,3-dihydroxy-2-(4-methoxyphenylsulfonamido)propanamide | CHEMBL1632639
Type:
Small organic molecule
Emp. Form.:
C10H14N2O6S
Mol. Mass.:
290.293
SMILES:
COc1ccc(cc1)S(=O)(=O)N[C@H](CO)C(=O)NO
: