Target
Histone deacetylase 5
Ligand
BDBM50333093
Substrate
Meas. Tech.
ChEMBL_690175 (CHEMBL1634305)
IC50
109±n/a nM
Citation
 Auzzas, LLarsson, AMatera, RBaraldi, ADeschênes-Simard, BGiannini, GCabri, WBattistuzzi, GGallo, GCiacci, AVesci, LPisano, C Non-Natural Macrocyclic Inhibitors of Histone Deacetylases: Design, Synthesis, and Activity J Med Chem 53:8387-8399 (2010)  
Target
Name:
Histone deacetylase 5
Synonyms:
Antigen NY-CO-9 HDAC5 Histone acetylase 5 (HDAC5) Human HDAC5 | KIAA0600
Type:
Enzyme
Mol. Mass.:
121968.61
Organism:
Homo sapiens (Human)
Description:
Q9UQL6
Residue:
1122
  
Inhibitor
Name:
BDBM50333093
Synonyms:
(S)-6-(19-Methoxy-11-oxo-3,13-dioxa-10-azatricyclo[15.3.1.04,9]henicosa-1(21),4(9),5,7,17,19-hexaen-12-yl)hexanoic acid hydroxyamide | CHEMBL1631917
Type:
Small organic molecule
Emp. Form.:
C25H32N2O6
Mol. Mass.:
456.5314
SMILES:
COc1cc2CCCO[C@@H](CCCCCC(=O)NO)C(=O)Nc3ccccc3OCc(c2)c1
: