Target
Glutamate receptor ionotropic, kainate 2
Ligand
BDBM50027828
Substrate
Meas. Tech.
ChEMBL_690218 (CHEMBL1634348)
Ki
>100000±n/a nM
Citation
 Frydenvang, KPickering, DSGreenwood, JRKrogsgaard-Larsen, NBrehm, LNielsen, BVogensen, SBHald, HKastrup, JSKrogsgaard-Larsen, P Biostructural and Pharmacological Studies of Bicyclic Analogues of the 3-Isoxazolol Glutamate Receptor Agonist Ibotenic Acid J Med Chem 53:8354-8361 (2010)  
Target
Name:
Glutamate receptor ionotropic, kainate 2
Synonyms:
GRIK2_RAT Glutamate receptor ionotropic kainate 2 Ionotropic glutamate receptor kainate 2/5
Type:
PROTEIN
Mol. Mass.:
102478.61
Organism:
Rattus norvegicus
Description:
ChEMBL_936439
Residue:
908
  
Inhibitor
Name:
BDBM50027828
Synonyms:
(7S)-3-hydroxy-4,5,6,7-tetrahydroisoxazolo[5,4-c]pyridine-7-carboxylic acid CHEMBL154535
Type:
Small organic molecule
Emp. Form.:
C7H8N2O4
Mol. Mass.:
184.1494
SMILES:
[O-]C(=O)C1[NH2+]CCc2c1o[nH]c2=O
: