Target
DNA-directed RNA polymerase II subunit RPB1
Ligand
BDBM50333128
Substrate
Meas. Tech.
ChEMBL_695614 (CHEMBL1639862)
IC50
>500000±n/a nM
Citation
 Lam, AMMurakami, EEspiritu, CSteuer, HMNiu, CKeilman, MBao, HZennou, VBourne, NJulander, JGMorrey, JDSmee, DFFrick, DNHeck, JAWang, PNagarathnam, DRoss, BSSofia, MJOtto, MJFurman, PA PSI-7851, a pronucleotide of beta-D-2'-deoxy-2'-fluoro-2'-C-methyluridine monophosphate, is a potent and pan-genotype inhibitor of hepatitis C virus replication. Antimicrob Agents Chemother 54:3187-96 (2010)  
Target
Name:
DNA-directed RNA polymerase II subunit RPB1
Synonyms:
POLR2 RPB1_HUMAN
Type:
PROTEIN
Mol. Mass.:
217191.83
Organism:
Homo sapiens (Human)
Description:
ChEMBL_695614
Residue:
1970
  
Inhibitor
Name:
BDBM50333128
Synonyms:
((2S,4R,5R)-5-(4-amino-2-oxopyrimidin-1(2H)-yl)-4-hydroxytetrahydrofuran-2-yl)methyl tetrahydrogen triphosphate 3'-dCTP | CHEMBL480328
Type:
Small organic molecule
Emp. Form.:
C9H16N3O13P3
Mol. Mass.:
467.1569
SMILES:
Nc1ccn([C@@H]2O[C@H](CO[P@@](O)(=O)O[P@@](O)(=O)OP(O)(O)=O)C[C@H]2O)c(=O)n1
: