Target
GABA-A receptor; alpha-2/beta-3/gamma-2
Ligand
BDBM50333160
Substrate
Meas. Tech.
ChEMBL_701328 (CHEMBL1648948)
Ki
1±n/a nM
Citation
 Nilsson, JGidlöf, RNielsen, EŘLiljefors, TNielsen, MSterner, O Triazoloquinazolinediones as novel high affinity ligands for the benzodiazepine site of GABA(A) receptors. Bioorg Med Chem 19:111-21 (2011)  
Target
Name:
GABA-A receptor; alpha-2/beta-3/gamma-2
Synonyms:
GABA receptor alpha-2/beta-3/gamma-2 subunit | Gamma-aminobutyric acid receptor subunit alpha-2/beta-3/gamma-2
Type:
Mol. Mass.:
Description:
ASSAY_ID of ChEMBL is 2148174
Components:
This complex has 3 components.
Component 1
Name:
Gamma-aminobutyric acid receptor subunit gamma-2
Synonyms:
GABA(A) receptor subunit gamma-2 GBRG2_HUMAN
Type:
PROTEIN
Mol. Mass.:
54172.74
Organism:
Homo sapiens (Human)
Description:
EBI_217
Residue:
467
  
Component 2
Name:
Gamma-aminobutyric acid receptor subunit beta-3
Synonyms:
GABA A receptor alpha-4/beta-3/gamma-2 GABA-A receptor GBRB3_HUMAN | agonist GABA site
Type:
PROTEIN
Mol. Mass.:
54130.51
Organism:
Homo sapiens (Human)
Description:
ChEMBL_448071
Residue:
473
  
Component 3
Name:
Gamma-aminobutyric acid receptor subunit alpha-2
Synonyms:
GABA receptor alpha-2 subunit GBRA2_HUMAN | Gamma-aminobutyric acid receptor subunit alpha-2 (GABRA2)
Type:
Protein
Mol. Mass.:
51338.78
Organism:
Homo sapiens (Human)
Description:
P47869
Residue:
451
  
Inhibitor
Name:
BDBM50333160
Synonyms:
9-Methyl-2-phenyl-2,6-dihydro[1,2,4]triazolo[4,3-c]quinazoline-3,5-dione | CHEMBL1644823
Type:
Small organic molecule
Emp. Form.:
C16H12N4O2
Mol. Mass.:
292.2921
SMILES:
Cc1ccc2[nH]c(=O)n3c(nn(-c4ccccc4)c3=O)c2c1
: