Target
Dipeptidyl peptidase 4
Ligand
BDBM50333174
Substrate
Meas. Tech.
ChEMBL_698095 (CHEMBL1646015)
IC50
53±n/a nM
Citation
 Miyamoto, YBanno, YYamashita, TFujimoto, TOi, SMoritoh, YAsakawa, TKataoka, OTakeuchi, KSuzuki, NIkedo, KKosaka, TTsubotani, STani, AFunami, MAmano, MYamamoto, YAertgeerts, KYano, JMaezaki, H Design and synthesis of 3-pyridylacetamide derivatives as dipeptidyl peptidase IV (DPP-4) inhibitors targeting a bidentate interaction with Arg125. Bioorg Med Chem 19:172-85 (2011)  
Target
Name:
Dipeptidyl peptidase 4
Synonyms:
ADABP Adenosine deaminase complexing protein 2 CD_antigen=CD26 DPP4 DPPIV Dipeptidyl peptidase 4 (DPP IV) Dipeptidyl peptidase 4 (DPP4) Dipeptidyl peptidase 4 membrane form Dipeptidyl peptidase IV Dipeptidyl peptidase IV (DDP-IV) Dipeptidyl peptidase IV membrane form Dipeptidyl peptidase-IV (DPP-4) T-cell activation antigen CD26 | TP103
Type:
Enzyme
Mol. Mass.:
88271.01
Organism:
Homo sapiens (Human)
Description:
P27487
Residue:
766
  
Inhibitor
Name:
BDBM50333174
Synonyms:
1-[6-Methyl-4-(4-methylphenyl)-2-(2-methylpropyl)-5-{2-[3-(methylsulfonyl)pyrrolidin-1-yl]-2-oxoethyl}pyridin-3-yl]methanamine dihydrochloride | CHEMBL1644847
Type:
Small organic molecule
Emp. Form.:
C25H35N3O3S
Mol. Mass.:
457.629
SMILES:
CC(C)Cc1nc(C)c(CC(=O)N2CCC(C2)S(C)(=O)=O)c(-c2ccc(C)cc2)c1CN
: