Target
Envelope glycoprotein gp160
Ligand
BDBM50333237
Substrate
Meas. Tech.
ChEMBL_698261 (CHEMBL1646731)
IC50
58500±n/a nM
Citation
 Lalonde, JMElban, MACourter, JRSugawara, ASoeta, TMadani, NPrinciotto, AMKwon, YDKwong, PDSchön, AFreire, ESodroski, JSmith, AB Design, synthesis and biological evaluation of small molecule inhibitors of CD4-gp120 binding based on virtual screening. Bioorg Med Chem 19:91-101 (2011)  
Target
Name:
Envelope glycoprotein gp160
Synonyms:
ENV_HV1Y2 Glycoprotein 120 SU TM env gp41
Type:
PROTEIN
Mol. Mass.:
95667.71
Organism:
Human immunodeficiency virus type 1 group M subtype B (isolate YU-2)(HIV-1)
Description:
ChEMBL_698262
Residue:
843
  
Inhibitor
Name:
BDBM50333237
Synonyms:
(R)-N1-(1-benzylpyrrolidin-3-yl)-N2-(4-chloro-3-fluorophenyl)oxalamide | CHEMBL1645261
Type:
Small organic molecule
Emp. Form.:
C19H19ClFN3O2
Mol. Mass.:
375.824
SMILES:
Fc1cc(NC(=O)C(=O)N[C@@H]2CCN(Cc3ccccc3)C2)ccc1Cl
: