Target
Envelope glycoprotein gp160
Ligand
BDBM50333278
Substrate
Meas. Tech.
ChEMBL_698261 (CHEMBL1646731)
IC50
>100000±n/a nM
Citation
 Lalonde, JMElban, MACourter, JRSugawara, ASoeta, TMadani, NPrinciotto, AMKwon, YDKwong, PDSchön, AFreire, ESodroski, JSmith, AB Design, synthesis and biological evaluation of small molecule inhibitors of CD4-gp120 binding based on virtual screening. Bioorg Med Chem 19:91-101 (2011)  
Target
Name:
Envelope glycoprotein gp160
Synonyms:
ENV_HV1Y2 Glycoprotein 120 SU TM env gp41
Type:
PROTEIN
Mol. Mass.:
95667.71
Organism:
Human immunodeficiency virus type 1 group M subtype B (isolate YU-2)(HIV-1)
Description:
ChEMBL_698262
Residue:
843
  
Inhibitor
Name:
BDBM50333278
Synonyms:
CHEMBL1645114 | N1-(4-bromophenyl)-N4-(2,2,6,6-tetramethylpiperidin-4-yl)succinamide
Type:
Small organic molecule
Emp. Form.:
C19H28BrN3O2
Mol. Mass.:
410.349
SMILES:
CC1(C)CC(CC(C)(C)N1)NC(=O)CCC(=O)Nc1ccc(Br)cc1
: