Target
Metabotropic glutamate receptor 1
Ligand
BDBM50301822
Substrate
Meas. Tech.
ChEMBL_698433 (CHEMBL1647365)
Ki
0.400000±n/a nM
Citation
 Fujinaga, MYamasaki, TKawamura, KKumata, KHatori, AYui, JYanamoto, KYoshida, YOgawa, MNengaki, NMaeda, JFukumura, TZhang, MR Synthesis and evaluation of 6-[1-(2-[(18)F]fluoro-3-pyridyl)-5-methyl-1H-1,2,3-triazol-4-yl]quinoline for positron emission tomography imaging of the metabotropic glutamate receptor type 1 in brain. Bioorg Med Chem 19:102-10 (2011)  
Target
Name:
Metabotropic glutamate receptor 1
Synonyms:
GPRC1A GRM1_HUMAN Metabotropic Glutamate 1a | metabotropic glutamate 1
Type:
Enzyme
Mol. Mass.:
132358.19
Organism:
Homo sapiens (Human)
Description:
Q13255
Residue:
1194
  
Inhibitor
Name:
BDBM50301822
Synonyms:
5-(1-(2-fluoropyridin-3-yl)-5-methyl-1H-1,2,3-triazol-4-yl)-2-propylisoindolin-1-one CHEMBL568443
Type:
Small organic molecule
Emp. Form.:
C19H18FN5O
Mol. Mass.:
351.3775
SMILES:
CCCN1Cc2cc(ccc2C1=O)-c1nnn(c1C)-c1cccnc1F
: