Target
Metabotropic glutamate receptor 1
Ligand
BDBM50273942
Substrate
Meas. Tech.
ChEMBL_698433 (CHEMBL1647365)
Ki
3.9±n/a nM
Citation
 Fujinaga, MYamasaki, TKawamura, KKumata, KHatori, AYui, JYanamoto, KYoshida, YOgawa, MNengaki, NMaeda, JFukumura, TZhang, MR Synthesis and evaluation of 6-[1-(2-[(18)F]fluoro-3-pyridyl)-5-methyl-1H-1,2,3-triazol-4-yl]quinoline for positron emission tomography imaging of the metabotropic glutamate receptor type 1 in brain. Bioorg Med Chem 19:102-10 (2011)  
Target
Name:
Metabotropic glutamate receptor 1
Synonyms:
GPRC1A GRM1_HUMAN Metabotropic Glutamate 1a | metabotropic glutamate 1
Type:
Enzyme
Mol. Mass.:
132358.19
Organism:
Homo sapiens (Human)
Description:
Q13255
Residue:
1194
  
Inhibitor
Name:
BDBM50273942
Synonyms:
4-(1-(2-fluoropyridin-3-yl)-5-methyl-1H-1,2,3-triazol-4-yl)-N-isopropyl-N-methyl-5,6-dihydropyridine-1(2H)-carboxamide CHEMBL1645350 | CHEMBL502882
Type:
Small organic molecule
Emp. Form.:
C18H23FN6O
Mol. Mass.:
358.4132
SMILES:
CC(C)N(C)C(=O)N1CCC(=CC1)c1nnn(c1C)-c1cccnc1F
: