Target
Metabotropic glutamate receptor 1
Ligand
BDBM50333367
Substrate
Meas. Tech.
ChEMBL_698434 (CHEMBL1647366)
IC50
1.4±n/a nM
Citation
 Fujinaga, MYamasaki, TKawamura, KKumata, KHatori, AYui, JYanamoto, KYoshida, YOgawa, MNengaki, NMaeda, JFukumura, TZhang, MR Synthesis and evaluation of 6-[1-(2-[(18)F]fluoro-3-pyridyl)-5-methyl-1H-1,2,3-triazol-4-yl]quinoline for positron emission tomography imaging of the metabotropic glutamate receptor type 1 in brain. Bioorg Med Chem 19:102-10 (2011)  
Target
Name:
Metabotropic glutamate receptor 1
Synonyms:
GRM1_MOUSE Grm1 | Mglur1
Type:
PROTEIN
Mol. Mass.:
133215.40
Organism:
Mus musculus
Description:
ChEMBL_698434
Residue:
1199
  
Inhibitor
Name:
BDBM50333367
Synonyms:
6-(1-(2-fluoropyridin-3-yl)-5-methyl-1H-1,2,3-triazol-4-yl)quinoline | CHEMBL1645352
Type:
Small organic molecule
Emp. Form.:
C17H12FN5
Mol. Mass.:
305.3091
SMILES:
Cc1c(nnn1-c1cccnc1F)-c1ccc2ncccc2c1
: