Target
D(2) dopamine receptor
Ligand
BDBM50333551
Substrate
Meas. Tech.
ChEMBL_699513 (CHEMBL1647768)
IC50
>1000±n/a nM
Citation
 Park, CMChoi, JIChoi, JHKim, SYPark, WKSeong, CM 1-(Arylsulfonyl)-2,3-dihydro-1H-quinolin-4-one derivatives as 5-HT(6) serotonin receptor ligands. Bioorg Med Chem Lett 21:698-703 (2011)  
Target
Name:
D(2) dopamine receptor
Synonyms:
D(2) dopamine receptor DOPAMINE D2 Long DRD2 Dopamine D2 receptor Dopamine D2 receptor (D2R) Dopamine2-like | d2
Type:
Cell-surface receptors
Mol. Mass.:
50647.10
Organism:
Homo sapiens (Human)
Description:
P14416
Residue:
443
  
Inhibitor
Name:
BDBM50333551
Synonyms:
2-ethyl-5-(N-methyl-piperazin-1-yl)-1-(naphthalene-2-sulfonyl)-2,3-dihydro-1H-quinolin-4-one | CHEMBL1642126
Type:
Small organic molecule
Emp. Form.:
C26H29N3O3S
Mol. Mass.:
463.592
SMILES:
CCC1CC(=O)c2c(cccc2N1S(=O)(=O)c1ccc2ccccc2c1)N1CCN(C)CC1
: