Target
Hepatocyte growth factor receptor
Ligand
BDBM50333572
Substrate
Meas. Tech.
ChEMBL_699677 (CHEMBL1648320)
IC50
51±n/a nM
Citation
 Zificsak, CATheroff, JPAimone, LDAlbom, MSAngeles, TSBrown, RAGalinis, DGrobelny, JVHerbertz, THusten, JKocsis, LSLoSardo, CMiknyoczki, SJMurthy, SRolon-Steele, DUnderiner, TLWells-Knecht, KJWorrell, CSZeigler, KSDorsey, BD 2,4-Diaminopyrimidine inhibitors of c-Met kinase bearing benzoxazepine anilines. Bioorg Med Chem Lett 21:660-3 (2011)  
Target
Name:
Hepatocyte growth factor receptor
Synonyms:
Hepatocyte growth factor receptor Hepatocyte growth factor receptor (c-MET) MET Met proto-oncogene (hepatocyte growth factor receptor) Tyrosine-protein kinase Met (c-Met) c-Met kinase
Type:
Protein
Mol. Mass.:
155559.73
Organism:
Homo sapiens (Human)
Description:
P08581
Residue:
1390
  
Inhibitor
Name:
BDBM50333572
Synonyms:
2-{5-Chloro-2-[9-(2-methoxy-acetyl)-6,7,8,9-tetrahydro-5-oxa-9-aza-benzocyclohepten-3-ylamino]-pyrimidin-4-ylamino}-3-fluoro-N-methyl-benzamide | CHEMBL1642146
Type:
Small organic molecule
Emp. Form.:
C24H24ClFN6O4
Mol. Mass.:
514.937
SMILES:
CNC(=O)c1cccc(F)c1Nc1nc(Nc2ccc3N(CCCOc3c2)C(=O)COC)ncc1Cl
: