Target
Insulin receptor
Ligand
BDBM50333564
Substrate
Meas. Tech.
ChEMBL_699678 (CHEMBL1648321)
IC50
820±n/a nM
Citation
 Zificsak, CATheroff, JPAimone, LDAlbom, MSAngeles, TSBrown, RAGalinis, DGrobelny, JVHerbertz, THusten, JKocsis, LSLoSardo, CMiknyoczki, SJMurthy, SRolon-Steele, DUnderiner, TLWells-Knecht, KJWorrell, CSZeigler, KSDorsey, BD 2,4-Diaminopyrimidine inhibitors of c-Met kinase bearing benzoxazepine anilines. Bioorg Med Chem Lett 21:660-3 (2011)  
Target
Name:
Insulin receptor
Synonyms:
INSR INSR_HUMAN Insulin receptor beta subunit
Type:
Receptor Tyrosine Kinase
Mol. Mass.:
156322.60
Organism:
Homo sapiens (Human)
Description:
P06213
Residue:
1382
  
Inhibitor
Name:
BDBM50333564
Synonyms:
3-[5-Chloro-4-(2-fluoro-6-methylcarbamoyl-phenylamino)-pyrimidin-2-ylamino]-7,8-dihydro-6H-5-oxa-9-aza-benzocycloheptene-9-carboxylic acid isopropyl ester | CHEMBL1642138
Type:
Small organic molecule
Emp. Form.:
C25H26ClFN6O4
Mol. Mass.:
528.963
SMILES:
CNC(=O)c1cccc(F)c1Nc1nc(Nc2ccc3N(CCCOc3c2)C(=O)OC(C)C)ncc1Cl
: