Target
Sodium/glucose cotransporter 2
Ligand
BDBM50333634
Substrate
Meas. Tech.
ChEMBL_699945 (CHEMBL1646352)
IC50
10.6±n/a nM
Citation
 Park, EJKong, YLee, JSLee, SHLee, J Exploration of SAR regarding glucose moiety in novel C-aryl glucoside inhibitors of SGLT2. Bioorg Med Chem Lett 21:742-6 (2011)  
Target
Name:
Sodium/glucose cotransporter 2
Synonyms:
Na(+)/glucose cotransporter 2 SGLT2 Sodium-Dependent Glucose Cotransporter 2 (SGLT2) Solute carrier family 5 member 2
Type:
Protein
Mol. Mass.:
72902.00
Organism:
Homo sapiens (Human)
Description:
P31639
Residue:
672
  
Inhibitor
Name:
BDBM50333634
Synonyms:
(2S,3R,4R,5S,6S)-2-(4-chloro-3-((5-(furan-2-yl)thiazol-2-yl)methyl)phenyl)-6-(fluoromethyl)tetrahydro-2H-pyran-3,4,5-triol | CHEMBL1642515
Type:
Small organic molecule
Emp. Form.:
C20H19ClFNO5S
Mol. Mass.:
439.885
SMILES:
O[C@@H]1[C@@H](CF)O[C@H]([C@H](O)[C@H]1O)c1ccc(Cl)c(Cc2ncc(s2)-c2ccco2)c1
: