Target
Voltage-dependent N-type calcium channel subunit alpha-1B
Ligand
BDBM50333714
Substrate
Meas. Tech.
ChEMBL_700439 (CHEMBL1647978)
IC50
660±n/a nM
Citation
 Tyagarajan, SChakravarty, PKPark, MZhou, BHerrington, JBRatliff, KBugianesi, RMWilliams, BHaedo, RJSwensen, AMWarren, VASmith, MGarcia, MKaczorowski, GJMcManus, OBLyons, KALi, XMadeira, MKaranam, BGreen, MForrest, MJAbbadie, CMcGowan, EMistry, SJochnowitz, NDuffy, JL A potent and selective indole N-type calcium channel (Ca(v)2.2) blocker for the treatment of pain. Bioorg Med Chem Lett 21:869-73 (2011)  
Target
Name:
Voltage-dependent N-type calcium channel subunit alpha-1B
Synonyms:
BIII CAC1B_HUMAN CACNA1B Calcium channel (Type N) Voltage-dependent N-type calcium channel subunit alpha-1B Voltage-gated N-type calcium channel alpha-1B subunit Voltage-gated calcium channel Voltage-gated calcium channel subunit alpha Cav2.2 ((alpha 1B, beta 1b, alpha 2 delta-1) | calcium channel, voltage-dependent, N type, alpha 1B subunit
Type:
Enzyme
Mol. Mass.:
262548.16
Organism:
Homo sapiens (Human)
Description:
Q00975
Residue:
2339
  
Inhibitor
Name:
BDBM50333714
Synonyms:
CHEMBL1643723 | tert-butyl 2-(5-(1-(tert-butylamino)-2-methyl-1-oxopropan-2-yl)-2-(3,5-dimethylphenyl)-1H-indol-1-yl)acetate
Type:
Small organic molecule
Emp. Form.:
C30H40N2O3
Mol. Mass.:
476.6502
SMILES:
Cc1cc(C)cc(c1)-c1cc2cc(ccc2n1CC(=O)OC(C)(C)C)C(C)(C)C(=O)NC(C)(C)C
: