Target
Carbonic anhydrase
Ligand
BDBM10855
Substrate
Meas. Tech.
ChEMBL_700659 (CHEMBL1645698)
Ki
675±n/a nM
Citation
 Bertucci, AInnocenti, AScozzafava, ATambutté, SZoccola, DSupuran, CT Carbonic anhydrase inhibitors. Inhibition studies with anions and sulfonamides of a new cytosolic enzyme from the scleractinian coral Stylophora pistillata. Bioorg Med Chem Lett 21:710-4 (2011)  
Target
Name:
Carbonic anhydrase
Synonyms:
Type:
PROTEIN
Mol. Mass.:
35119.71
Organism:
Stylophora pistillata
Description:
ChEMBL_700659
Residue:
316
  
Inhibitor
Name:
BDBM10855
Synonyms:
2-aminobenzene-1-sulfonamide US10172837, 2-aminobenzenesulfonamide orthanilamide 17
Type:
Small organic molecule
Emp. Form.:
C6H8N2O2S
Mol. Mass.:
172.205
SMILES:
Nc1ccccc1S(N)(=O)=O
: