Target
Thioredoxin reductase 1, cytoplasmic
Ligand
BDBM50060874
Substrate
Meas. Tech.
ChEMBL_700048 (CHEMBL1646825)
IC50
198000±n/a nM
Citation
 Sorrentino, FKarioti, AGratteri, PRigobello, MPScutari, GMessori, LBindoli, AChioccioli, MGabbiani, CBergonzi, MCBilia, AR Hypericins and thioredoxin reductase: Biochemical and docking studies disclose the molecular basis for effective inhibition by naphthodianthrones. Bioorg Med Chem 19:631-41 (2011)  
Target
Name:
Thioredoxin reductase 1, cytoplasmic
Synonyms:
NADPH-dependent thioredoxin reductase TRXR1_RAT Trxr1 | Txnrd1
Type:
PROTEIN
Mol. Mass.:
54519.34
Organism:
Rattus norvegicus
Description:
ChEMBL_589950
Residue:
498
  
Inhibitor
Name:
BDBM50060874
Synonyms:
1,3,4,6,8,13-hexahydroxy-10,11-dimethylphenanthro[1,10,9,8-opqra]perylene-7,14-dione CHEMBL286494 Hyperizin hypericine | hypericum red
Type:
Small organic molecule
Emp. Form.:
C30H16O8
Mol. Mass.:
504.4432
SMILES:
Cc1cc(O)c2c3c1c1c(C)cc(O)c4c1c1c3c3c(c(O)cc(O)c3c2=O)c2c(O)cc(O)c(c12)c4=O
: