Target
Thioredoxin reductase 2, mitochondrial
Ligand
BDBM50240382
Substrate
Meas. Tech.
ChEMBL_700049 (CHEMBL1646826)
IC50
>200000±n/a nM
Citation
 Sorrentino, FKarioti, AGratteri, PRigobello, MPScutari, GMessori, LBindoli, AChioccioli, MGabbiani, CBergonzi, MCBilia, AR Hypericins and thioredoxin reductase: Biochemical and docking studies disclose the molecular basis for effective inhibition by naphthodianthrones. Bioorg Med Chem 19:631-41 (2011)  
Target
Name:
Thioredoxin reductase 2, mitochondrial
Synonyms:
TRXR2_RAT Txnrd2
Type:
PROTEIN
Mol. Mass.:
56441.28
Organism:
Rattus norvegicus
Description:
ChEMBL_700049
Residue:
525
  
Inhibitor
Name:
BDBM50240382
Synonyms:
1,4-Dihydroxyanthrachinon 1,4-dihydroxyanthra-9,10-quinone 1,4-dihydroxyanthraquinone Chinizarin quinizarine
Type:
Small organic molecule
Emp. Form.:
C14H8O4
Mol. Mass.:
240.2109
SMILES:
Oc1ccc(O)c2C(=O)c3ccccc3C(=O)c12
: