Target
Integrin alpha-L/beta-2
Ligand
BDBM50333904
Substrate
Meas. Tech.
ChEMBL_700233 (CHEMBL1647334)
IC50
26±n/a nM
Citation
 Zhong, MHanan, EJShen, WBui, MArkin, MRBarr, KJEvanchik, MJHoch, UHyde, JMartell, JROslob, JDPaulvannan, KPrabhu, SSilverman, JAWright, JYu, CHZhu, JFlanagan, WM Structure-activity relationship (SAR) of thea-amino acid residue of potent tetrahydroisoquinoline (THIQ)-derived LFA-1/ICAM-1 antagonists. Bioorg Med Chem Lett 21:307-10 (2010)  
Target
Name:
Integrin alpha-L/beta-2
Synonyms:
Integrin alpha-L/beta-2 (LFA-1) | Integrin beta-2/Leukocyte adhesion glycoprotein LFA-1 alpha
Type:
Mol. Mass.:
Description:
ASSAY_ID of EBI is 32646
Components:
This complex has 2 components.
Component 1
Name:
Integrin alpha-L
Synonyms:
CD11 antigen-like family member A CD_antigen=CD11a ITGAL LFA-1A Leukocyte adhesion glycoprotein LFA-1 alpha chain | Leukocyte function-associated molecule 1 alpha chain
Type:
PROTEIN
Mol. Mass.:
128748.90
Organism:
Homo sapiens (Human)
Description:
ChEMBL_629045
Residue:
1170
  
Component 2
Name:
Integrin beta-2
Synonyms:
CD18 ITGB2 MFI7
Type:
PROTEIN
Mol. Mass.:
84785.60
Organism:
Homo sapiens (Human)
Description:
EBI_12662
Residue:
769
  
Inhibitor
Name:
BDBM50333904
Synonyms:
(S)-2-(5,7-dichloro-2-(4-chlorobenzoyl)-1,2,3,4-tetrahydroisoquinoline-6-carboxamido)-3-(5-methyl-1-(methylsulfonyl)-1H-indole-3-carboxamido)propanoic acid | CHEMBL1644118
Type:
Small organic molecule
Emp. Form.:
C31H27Cl3N4O7S
Mol. Mass.:
705.993
SMILES:
Cc1ccc2n(cc(C(=O)NC[C@H](NC(=O)c3c(Cl)cc4CN(CCc4c3Cl)C(=O)c3ccc(Cl)cc3)C(O)=O)c2c1)S(C)(=O)=O
: