Target
Beta-secretase 1
Ligand
BDBM50333943
Substrate
Meas. Tech.
ChEMBL_700286 (CHEMBL1647504)
IC50
30±n/a nM
Citation
 Sund, CBelda, OWiktelius, DSahlberg, CVrang, LSedig, SHamelink, EHenderson, IAgback, TJansson, KBorkakoti, NDerbyshire, DEneroth, ASamuelsson, B Design and synthesis of potent macrocyclic renin inhibitors. Bioorg Med Chem Lett 21:358-62 (2010)  
Target
Name:
Beta-secretase 1
Synonyms:
ASP2 Aspartyl protease 2 BACE1 Beta-secretase (BACE) Beta-secretase 1 (BACE 1) Beta-secretase 1 (BACE1) Beta-site amyloid precursor protein cleaving enzyme 1 Memapsin-2 beta-Secretase (BACE-1) | beta-Secretase (BACE1)
Type:
Protein
Mol. Mass.:
55755.10
Organism:
Homo sapiens (Human)
Description:
P56817
Residue:
501
  
Inhibitor
Name:
BDBM50333943
Synonyms:
CHEMBL1644461 | N1-((2S,3S,5S)-5-((S)-1-(benzylamino)-3-methyl-1-oxobutan-2-ylcarbamoyl)-1-(benzyloxy)-3-hydroxy-6-methylheptan-2-yl)-5-(N-methylmethylsulfonamido)-N3-((R)-1-phenylethyl)isophthalamide
Type:
Small organic molecule
Emp. Form.:
C46H59N5O8S
Mol. Mass.:
842.054
SMILES:
CC(C)[C@H](C[C@H](O)[C@H](COCc1ccccc1)NC(=O)c1cc(cc(c1)C(=O)N[C@H](C)c1ccccc1)N(C)S(C)(=O)=O)C(=O)N[C@@H](C(C)C)C(=O)NCc1ccccc1
: