Target
Metabotropic glutamate receptor 5
Ligand
BDBM50334116
Substrate
Meas. Tech.
ChEMBL_698079 (CHEMBL1645999)
IC50
181±n/a nM
Citation
 Gilbert, AMBursavich, MGLombardi, SAdedoyin, ADwyer, JMHughes, ZKern, JCKhawaja, XRosenzweig-Lipson, SMoore, WJNeal, SJOlsen, MRizzo, SJSpringer, D 3-(Pyridin-2-yl-ethynyl)benzamide metabotropic glutamate receptor 5 negative allosteric modulators: hit to lead studies. Bioorg Med Chem Lett 21:195-9 (2010)  
Target
Name:
Metabotropic glutamate receptor 5
Synonyms:
GRM5_RAT Grm5 Mglur5 metabotropic glutamate 5/1-C metabotropic glutamate 5a
Type:
Enzyme
Mol. Mass.:
131900.14
Organism:
Rattus norvegicus (Rat)
Description:
P31424
Residue:
1203
  
Inhibitor
Name:
BDBM50334116
Synonyms:
(4-(5-methylpyridin-2-yl)piperazin-1-yl)(3-(phenylethynyl)phenyl)methanone | CHEMBL1645011
Type:
Small organic molecule
Emp. Form.:
C25H23N3O
Mol. Mass.:
381.4696
SMILES:
Cc1ccc(nc1)N1CCN(CC1)C(=O)c1cccc(c1)C#Cc1ccccc1
: