Target
Alpha-2A adrenergic receptor
Ligand
BDBM50271255
Substrate
Meas. Tech.
ChEMBL_698563 (CHEMBL1647738)
EC50
160±n/a nM
Citation
 Saczewski, FKornicka, AHudson, ALLaird, SScheinin, MLaurila, JMRybczynska, ABoblewski, KLehmann, AGdaniec, M 3-[(Imidazolidin-2-yl)imino]indazole ligands with selectivity for thea(2)-adrenoceptor compared to the imidazoline I(1) receptor. Bioorg Med Chem 19:321-9 (2011)  
Target
Name:
Alpha-2A adrenergic receptor
Synonyms:
ADA2A_HUMAN ADRA2R Adrenergic alpha2A Alpha-2 adrenergic receptor subtype C10 Alpha-2A adrenoreceptor alpha-2A adrenergic receptor [Homo sapiens]
Type:
Enzyme
Mol. Mass.:
48979.91
Organism:
Homo sapiens (Human)
Description:
P08913
Residue:
450
  
Inhibitor
Name:
BDBM50271255
Synonyms:
1-[(Imidazolidin-2-yl)imino]indazole hydrochloride CHEMBL454712
Type:
Small organic molecule
Emp. Form.:
C10H11N5
Mol. Mass.:
201.2278
SMILES:
[#6]-1-[#6]-[#7]\[#6](-[#7]-1)=[#7]/n1ncc2ccccc12
: