Target
Alpha-2A adrenergic receptor
Ligand
BDBM50270556
Substrate
Meas. Tech.
ChEMBL_698563 (CHEMBL1647738)
EC50
37±n/a nM
Citation
 Saczewski, FKornicka, AHudson, ALLaird, SScheinin, MLaurila, JMRybczynska, ABoblewski, KLehmann, AGdaniec, M 3-[(Imidazolidin-2-yl)imino]indazole ligands with selectivity for thea(2)-adrenoceptor compared to the imidazoline I(1) receptor. Bioorg Med Chem 19:321-9 (2011)  
Target
Name:
Alpha-2A adrenergic receptor
Synonyms:
ADA2A_HUMAN ADRA2R Adrenergic alpha2A Alpha-2 adrenergic receptor subtype C10 Alpha-2A adrenoreceptor alpha-2A adrenergic receptor [Homo sapiens]
Type:
Enzyme
Mol. Mass.:
48979.91
Organism:
Homo sapiens (Human)
Description:
P08913
Residue:
450
  
Inhibitor
Name:
BDBM50270556
Synonyms:
1-[(Imidazolidin-2-yl)imino]-7-methylindazole hydrochloride CHEMBL478356
Type:
Small organic molecule
Emp. Form.:
C11H13N5
Mol. Mass.:
215.2544
SMILES:
[#6]-c1cccc2cnn(\[#7]=[#6]-3\[#7]-[#6]-[#6]-[#7]-3)c12
: