Target
Peroxisome proliferator-activated receptor gamma
Ligand
BDBM50334216
Substrate
Meas. Tech.
ChEMBL_698586 (CHEMBL1647859)
EC50
1200±n/a nM
Citation
 Ushiroda, KMaruta, KKitoh, MIwai, KNagamine, JTsuchida, ATaiji, MNagata, R Development of a new class of benzoylpyrrole-based PPARa/¿ activators. Bioorg Med Chem Lett 21:220-4 (2010)  
Target
Name:
Peroxisome proliferator-activated receptor gamma
Synonyms:
NR1C3 PPAR-gamma PPARG_HUMAN Peroxisome proliferator-activated receptor gamma (PPAR gamma) Peroxisome proliferator-activated receptor gamma (PPARĪ³) peroxisome proliferator-activated receptor gamma isoform 2
Type:
Nuclear Receptor
Mol. Mass.:
57613.46
Organism:
Homo sapiens (Human)
Description:
P37231
Residue:
505
  
Inhibitor
Name:
BDBM50334216
Synonyms:
2-(3-(3-(2-(4-methylbenzoyl)-1H-pyrrol-1-yl)prop-1-enyl)phenoxy)acetic acid | CHEMBL1641718
Type:
Small organic molecule
Emp. Form.:
C23H21NO4
Mol. Mass.:
375.4171
SMILES:
Cc1ccc(cc1)C(=O)c1cccn1C\C=C\c1cccc(OCC(O)=O)c1
: