Target
Mitogen-activated protein kinase kinase kinase 5
Ligand
BDBM50334272
Substrate
Meas. Tech.
ChEMBL_699648 (CHEMBL1648128)
IC50
18900±n/a nM
Citation
 Okamoto, MSaito, NKojima, HOkabe, TTakeda, KIchijo, HFuruya, TNagano, T Identification of novel ASK1 inhibitors using virtual screening. Bioorg Med Chem 19:486-9 (2011)  
Target
Name:
Mitogen-activated protein kinase kinase kinase 5
Synonyms:
ASK1 MAP3K5 MEKK5
Type:
Protein
Mol. Mass.:
154514.93
Organism:
Homo sapiens (Human)
Description:
Q99683
Residue:
1374
  
Inhibitor
Name:
BDBM50334272
Synonyms:
CHEMBL1642669 | N6-(2,5-dimethoxyphenyl)-9H-purine-2,6-diamine
Type:
Small organic molecule
Emp. Form.:
C13H14N6O2
Mol. Mass.:
286.2893
SMILES:
COc1ccc(OC)c(Nc2nc(N)nc3nc[nH]c23)c1
: