Target
Amine oxidase [flavin-containing] B
Ligand
BDBM50334282
Substrate
Meas. Tech.
ChEMBL_699651 (CHEMBL1648131)
Ki
5510±n/a nM
Citation
 Manley-King, CIBergh, JJPetzer, JP Inhibition of monoamine oxidase by selected C5- and C6-substituted isatin analogues. Bioorg Med Chem 19:261-74 (2011)  
Target
Name:
Amine oxidase [flavin-containing] B
Synonyms:
AOFB_HUMAN MAOB Monoamine oxidase type B (MAO B) Monoamine oxidase type B (MAOB)
Type:
Protein
Mol. Mass.:
58768.76
Organism:
Homo sapiens (Human)
Description:
P27338
Residue:
520
  
Inhibitor
Name:
BDBM50334282
Synonyms:
4-benzyloxyaniline EN300-16806
Type:
Small organic molecule
Emp. Form.:
C13H13NO
Mol. Mass.:
199.2484
SMILES:
Nc1ccc(OCc2ccccc2)cc1
: