Target
Amine oxidase [flavin-containing] A
Ligand
BDBM50334287
Substrate
Meas. Tech.
ChEMBL_699650 (CHEMBL1648130)
Ki
1830±n/a nM
Citation
 Manley-King, CIBergh, JJPetzer, JP Inhibition of monoamine oxidase by selected C5- and C6-substituted isatin analogues. Bioorg Med Chem 19:261-74 (2011)  
Target
Name:
Amine oxidase [flavin-containing] A
Synonyms:
AOFA_HUMAN MAO-A Monoamine oxidase Monoamine oxidase type A (MAO A) Monoamine oxidase type A (MAOA)
Type:
Protein
Mol. Mass.:
59689.53
Organism:
Homo sapiens (Human)
Description:
P21397
Residue:
527
  
Inhibitor
Name:
BDBM50334287
Synonyms:
6-(2-Phenylethyl)isatin | CHEMBL1642673
Type:
Small organic molecule
Emp. Form.:
C16H13NO2
Mol. Mass.:
251.2799
SMILES:
O=C1Nc2cc(CCc3ccccc3)ccc2C1=O
: