Target
Growth factor receptor-bound protein 7
Ligand
BDBM50334295
Substrate
Meas. Tech.
ChEMBL_699661 (CHEMBL1648304)
Kd
6570±n/a nM
Citation
 Ambaye, NDGunzburg, MJLim, RCPrice, JTWilce, MCWilce, JA Benzopyrazine derivatives: A novel class of growth factor receptor bound protein 7 antagonists. Bioorg Med Chem 19:693-701 (2011)  
Target
Name:
Growth factor receptor-bound protein 7
Synonyms:
B47 GRB7 GRB7_HUMAN
Type:
PROTEIN
Mol. Mass.:
59700.56
Organism:
Homo sapiens (Human)
Description:
ChEMBL_699661
Residue:
532
  
Inhibitor
Name:
BDBM50334295
Synonyms:
CHEMBL1642688 | methyl 5-(2-cyano-4-nitrophenylamino)-3-(3-hydroxy-6-nitroquinoxalin-2-yl)-2,4,5-trioxopentanoate
Type:
Small organic molecule
Emp. Form.:
C21H12N6O10
Mol. Mass.:
508.3542
SMILES:
COC(=O)C(=O)C(C(=O)C(=O)Nc1ccc(cc1C#N)[N+]([O-])=O)c1nc2ccc(cc2[nH]c1=O)[N+]([O-])=O
: