Target
Beta-carbonic anhydrase 1
Ligand
BDBM50334343
Substrate
Meas. Tech.
ChEMBL_700107 (CHEMBL1646989)
Ki
440±n/a nM
Citation
 Pacchiano, FCarta, FVullo, DScozzafava, ASupuran, CT Inhibition ofß-carbonic anhydrases with ureido-substituted benzenesulfonamides. Bioorg Med Chem Lett 21:102-5 (2010)  
Target
Name:
Beta-carbonic anhydrase 1
Synonyms:
β-Carbonic anhydrase 1 (CA 1) MTCA1_MYCTU canA | mtcA1
Type:
Enzyme
Mol. Mass.:
18186.06
Organism:
Mycobacterium tuberculosis
Description:
The recombinant GST-mtCA1 construct was cloned, expressed, and further purified from E. coli. The purified protein was used in inhibition assays.
Residue:
163
  
Inhibitor
Name:
BDBM50334343
Synonyms:
4-(3-benzylureido)benzenesulfonamide CHEMBL1643289
Type:
Small organic molecule
Emp. Form.:
C14H15N3O3S
Mol. Mass.:
305.352
SMILES:
NS(=O)(=O)c1ccc(NC(=O)NCc2ccccc2)cc1
: