Target
Neuronal acetylcholine receptor subunit alpha-6
Ligand
BDBM50119780
Substrate
Meas. Tech.
ChEMBL_701134 (CHEMBL1648232)
IC50
70±n/a nM
Citation
 Zhang, ZZheng, GPivavarchyk, MDeaciuc, AGDwoskin, LPCrooks, PA Novel bis-, tris-, and tetrakis-tertiary amino analogs as antagonists at neuronal nicotinic receptors that mediate nicotine-evoked dopamine release. Bioorg Med Chem Lett 21:88-91 (2010)  
Target
Name:
Neuronal acetylcholine receptor subunit alpha-6
Synonyms:
ACHA6_RAT Chrna6 Neuronal acetylcholine receptor subunit alpha-6 | Neuronal acetylcholine receptor subunit alpha-6/beta-3
Type:
PROTEIN
Mol. Mass.:
56943.53
Organism:
Rattus norvegicus
Description:
ChEMBL_1454451
Residue:
493
  
Inhibitor
Name:
BDBM50119780
Synonyms:
1,10-di(2-isoquinoliniumyl)decane; with diiodide ions 2,2'-(decane-1,10-diyl)diisoquinolinium iodide CHEMBL1643944
Type:
Small organic molecule
Emp. Form.:
C28H34N2
Mol. Mass.:
398.5819
SMILES:
C(CCCCC[n+]1ccc2ccccc2c1)CCCC[n+]1ccc2ccccc2c1
: