Target
ALK tyrosine kinase receptor
Ligand
BDBM50334603
Substrate
Meas. Tech.
ChEMBL_698756 (CHEMBL1648481)
IC50
100±n/a nM
Citation
 Mesaros, EFBurke, JPParrish, JDDugan, BJAnzalone, AVAngeles, TSAlbom, MSAimone, LDQuail, MRWan, WLu, LHuang, ZAtor, MARuggeri, BACheng, MOtt, GRDorsey, BD Novel 2,3,4,5-tetrahydro-benzo[d]azepine derivatives of 2,4-diaminopyrimidine, selective and orally bioavailable ALK inhibitors with antitumor efficacy in ALCL mouse models. Bioorg Med Chem Lett 21:463-6 (2010)  
Target
Name:
ALK tyrosine kinase receptor
Synonyms:
ALK ALK_HUMAN CD_antigen: CD246
Type:
Protein
Mol. Mass.:
176453.10
Organism:
Homo sapiens (Human)
Description:
Q9UM73
Residue:
1620
  
Inhibitor
Name:
BDBM50334603
Synonyms:
2-(7-(5-chloro-4-(2-methoxy-4-morpholinophenylamino)pyrimidin-2-ylamino)-8-methoxy-4,5-dihydro-1H-benzo[d]azepin-3(2H)-yl)-N-methylacetamide | CHEMBL1642262
Type:
Small organic molecule
Emp. Form.:
C29H36ClN7O4
Mol. Mass.:
582.094
SMILES:
CNC(=O)CN1CCc2cc(Nc3ncc(Cl)c(Nc4ccc(cc4OC)N4CCOCC4)n3)c(OC)cc2CC1
: