Target
11-beta-hydroxysteroid dehydrogenase 1
Ligand
BDBM50334678
Substrate
Meas. Tech.
ChEMBL_699052 (CHEMBL1646333)
IC50
1.8±n/a nM
Citation
 Sun, DWang, ZCaille, SDeGraffenreid, MGonzalez-Lopez de Turiso, FHungate, RJaen, JCJiang, BJulian, LDKelly, RMcMinn, DLKaizerman, JRew, YSudom, ATu, HUrsu, SWalker, NWillcockson, MYan, XYe, QPowers, JP Synthesis and optimization of novel 4,4-disubstituted cyclohexylbenzamide derivatives as potent 11ß-HSD1 inhibitors. Bioorg Med Chem Lett 21:405-10 (2010)  
Target
Name:
11-beta-hydroxysteroid dehydrogenase 1
Synonyms:
11-DH 11-beta-Hydroxysteroid Dehydrogenase 1 (11-beta-HSD1) 11-beta-hydroxysteroid dehydrogenase 1 (11HSD1) Corticosteroid 11-beta-dehydrogenase isozyme 1 (11-beta-HSD-1) Corticosteroid 11-beta-dehydrogenase isozyme 1 (11beta-HSD1) HSD11 HSD11L | SDR26C1
Type:
Enzyme
Mol. Mass.:
32409.16
Organism:
Homo sapiens (Human)
Description:
P28845
Residue:
292
  
Inhibitor
Name:
BDBM50334678
Synonyms:
CHEMBL1642598 | N-((4S)-4-(3-amino-3-oxopropyl)-4-(4-fluorophenyl)cyclohexyl)-N-cyclopropyl-4-((S)-1,1,1-trifluoro-2-hydroxypropan-2-yl)benzamide
Type:
Small organic molecule
Emp. Form.:
C28H32F4N2O3
Mol. Mass.:
520.5589
SMILES:
C[C@](O)(c1ccc(cc1)C(=O)N(C1CC1)[C@H]1CC[C@@](CCC(N)=O)(CC1)c1ccc(F)cc1)C(F)(F)F
: