Target
11-beta-hydroxysteroid dehydrogenase 1
Ligand
BDBM50334675
Substrate
Meas. Tech.
ChEMBL_699054 (CHEMBL1646335)
IC50
20±n/a nM
Citation
 Sun, DWang, ZCaille, SDeGraffenreid, MGonzalez-Lopez de Turiso, FHungate, RJaen, JCJiang, BJulian, LDKelly, RMcMinn, DLKaizerman, JRew, YSudom, ATu, HUrsu, SWalker, NWillcockson, MYan, XYe, QPowers, JP Synthesis and optimization of novel 4,4-disubstituted cyclohexylbenzamide derivatives as potent 11ß-HSD1 inhibitors. Bioorg Med Chem Lett 21:405-10 (2010)  
Target
Name:
11-beta-hydroxysteroid dehydrogenase 1
Synonyms:
11-DH 11-beta-Hydroxysteroid Dehydrogenase 1 (11-beta-HSD1) 11-beta-hydroxysteroid dehydrogenase 1 (11HSD1) Corticosteroid 11-beta-dehydrogenase isozyme 1 (11-beta-HSD-1) Corticosteroid 11-beta-dehydrogenase isozyme 1 (11beta-HSD1) HSD11 HSD11L | SDR26C1
Type:
Enzyme
Mol. Mass.:
32409.16
Organism:
Homo sapiens (Human)
Description:
P28845
Residue:
292
  
Inhibitor
Name:
BDBM50334675
Synonyms:
((1R)-4-(N-cyclopropyl-4-((S)-1,1,1-trifluoro-2-hydroxypropan-2-yl)benzamido)-1-phenylcyclohexyl)methyl carbamate | CHEMBL1642595
Type:
Small organic molecule
Emp. Form.:
C27H31F3N2O4
Mol. Mass.:
504.5412
SMILES:
C[C@](O)(c1ccc(cc1)C(=O)N(C1CC1)[C@H]1CC[C@@](COC(N)=O)(CC1)c1ccccc1)C(F)(F)F
: