Target
Lysosomal alpha-glucosidase
Ligand
BDBM50335395
Substrate
Meas. Tech.
ChEMBL_701785 (CHEMBL1656922)
IC50
>1000000±n/a nM
Citation
 Ghisaidoobe, ABikker, Pde Bruijn, ACGodschalk, FDRogaar, EGuijt, MCHagens, PHalma, JMHart, SMLuitjens, SBvan Rixel, VHWijzenbroek, MZweegers, TDonker-Koopman, WEStrijland, ABoot, RMarel, GvOverkleeft, HSAerts, JM Identification of Potent and Selective Glucosylceramide Synthase Inhibitors from a Library of N-Alkylated Iminosugars ACS Med Chem Lett 2:119-123 (2011)  
Target
Name:
Lysosomal alpha-glucosidase
Synonyms:
α-Glucosidase Gaa Lysosomal alpha-glucosidase | alpha-glucosidase (Gaa)
Type:
Enzyme
Mol. Mass.:
106235.32
Organism:
Mus musculus (Mouse)
Description:
P70699
Residue:
953
  
Inhibitor
Name:
BDBM50335395
Synonyms:
CHEMBL1651555 | N-Heptyl-L-ido-1-deoxynojirimycin
Type:
Small organic molecule
Emp. Form.:
C13H27NO4
Mol. Mass.:
261.3578
SMILES:
CCCCCCCN1C[C@H](O)[C@@H](O)[C@H](O)[C@@H]1CO
: